{"text_format":"1","workbook":"xlsx","n_sheets":17,"sheets":["Personální údaje","Evidence docházky","Tabulky mzdy","Leden","Únor","Březen","Duben","Květen","Červen","Červenec","Srpen","Září","Říjen","Listopad","Prosinec","Tabulky daně","Roční zúčtování daně "],"not_rendered":{"charts":0,"images":0,"macros":1,"external_links":0,"defined_names":0,"comments":0,"pivot_tables":0},"unopened":[],"bounds":{"document_bytes":16777216,"sheet_cells":100000,"rows_first":2000,"rows_last":500,"rows_between":2000,"halvings":0,"cell_chars":16384,"cell_head_chars":4096},"cells_cut":0,"cells_raw":0,"read":"whole","date_system":"1900"}

{"sheet":"Personální údaje","index":0,"n_rows":7,"n_cols":14,"rows_kept":7,"cut":false,"hidden":false,"merged":[]}
[]
["Jméno a příjmení","Středisko","Adresa","Datum narození","Druh pracovního poměru","Osobní číslo","Rodné Číslo","Telefon","Číslo účtu","Jméno dítěte","Rodné číslo dítěte","Počet dětí","Podepsal prohlášení","Sleva poplatník"]
[null,null,null,null,null,1,null,null,null,null,null,null,null,{"$f":"IF(M3=\"ano\",2070,0)","v":0}]
[null,null,null,null,null,2,null,null,null,null,null,null,null,{"$f":"IF(M4=\"ano\",2070,0)","v":0}]
[null,null,null,null,null,3,null,null,null,null,null,null,null,0]
[null,null,null,null,null,4,null,null,null,null,null,null,null,0]
[null,null,null,null,null,5,null,null,null,null,null,null,null,0]

{"sheet":"Evidence docházky","index":1,"n_rows":107,"n_cols":40,"rows_kept":107,"cut":false,"hidden":false,"merged":[]}
[]
[null,null,"PÁ","SO","NE","PO","ÚT","ST","ČT","PÁ","SO","NE","PO","ÚT","ST","ČT","PÁ","SO","NE","PO","ÚT","ST","ČT","PÁ","SO","NE","PO","ÚT","ST","ČT","PÁ","SO","NE"]
["Osobní číslo zaměstnance","Jméno",null,null,null,null,null,null,null,null,null,null,null,null,null,null,null,null,null,null,null,null,null,null,null,null,null,null,null,null,null,null,null,"Celkem hodin","so+ne","noční","Dovolená","Svátek","Odměny","Stravné"]
[{"$f":"'Personální údaje'!F3","v":1},{"$f":"'Personální údaje'!A3","v":0},null,null,null,null,null,null,null,null,null,null,null,null,null,null,null,null,null,null,null,null,null,null,null,null,null,null,null,null,null,null,null,{"$f":"SUM(C4:AG4)","v":0},{"$f":"SUM(Y4+AF4+AG4)","v":0},{"$f":"H4+I4+P4+Q4+X4+Y4+AF4+AG4","v":0},0,0]
[{"$f":"'Personální údaje'!F4","v":2},{"$f":"'Personální údaje'!A4","v":0},null,null,null,null,null,null,null,null,null,null,null,null,null,null,null,null,null,null,null,null,null,null,null,null,null,null,null,null,null,null,null,{"$f":"SUM(C5:AG5)","v":0},{"$f":"SUM(Y5+AF5+AG5+K5)","v":0},null,0,0]
[{"$f":"'Personální údaje'!F5","v":3},{"$f":"'Personální údaje'!A5","v":0},null,null,null,null,null,null,null,null,null,null,null,null,null,null,null,null,null,null,null,null,null,null,null,null,null,null,null,null,null,null,null,{"$f":"SUM(C6:AG6)","v":0},{"$f":"SUM(Y6+AF6+AG6)","v":0},{"$f":"H6+I6+P6+Q6+X6+Y6+AF6+AG6","v":0},0,0]
[{"$f":"'Personální údaje'!F6","v":4},{"$f":"'Personální údaje'!A6","v":0},null,null,null,null,null,null,null,null,null,null,null,null,null,null,null,null,null,null,null,null,null,null,null,null,null,null,null,null,null,null,null,{"$f":"SUM(C7:AF7)","v":0},{"$f":"SUM(Y7+AF7+AG7+R7)","v":0},null,0,0]
[{"$f":"'Personální údaje'!F7","v":5},{"$f":"'Personální údaje'!A7","v":0},null,null,null,null,null,null,null,null,null,null,null,null,null,null,null,null,null,null,null,null,null,null,null,null,null,null,null,null,null,null,null,{"$f":"SUM(C8:AG8)","v":0},{"$f":"SUM(Y8+AF8+AG8)","v":0},null,0,0]
[]
[]
[null,null,"PO","ÚT","ST","ČT","PÁ","SO","NE","PO","ÚT","ST","ČT","PÁ","SO","NE","PO","ÚT","ST","ČT","PÁ","SO","NE","PO","ÚT","ST","ČT","PÁ","SO","NE","PO"]
["Osobní číslo zaměstnance","Jméno",1,2,3,4,5,6,7,8,9,10,11,12,13,14,15,16,17,18,19,20,21,22,23,24,25,26,27,28,29,"Celkem hodin","so+ne","noční","Dovolená","Svátek","Odměny","Stravné"]
[{"$f":"'Personální údaje'!F3","v":1},{"$f":"'Personální údaje'!A3","v":0},null,null,null,null,null,null,null,null,null,null,null,null,null,null,null,null,null,null,null,null,null,null,null,null,null,null,null,null,null,{"$f":"SUM(C13:AE13)","v":0},{"$f":"AD13+AC13+V13","v":0},{"$f":"E13+F13+M13+N13+U13+V13+AC13+AD13","v":0},0,0]
[{"$f":"'Personální údaje'!F4","v":2},{"$f":"'Personální údaje'!A4","v":0},null,null,null,null,null,null,null,null,null,null,null,null,null,null,null,null,null,null,null,null,null,null,null,null,null,null,null,null,null,{"$f":"SUM(C14:AE14)","v":0},{"$f":"AD14+AC14+V14+H14","v":0},null,0,0]
[{"$f":"'Personální údaje'!F5","v":3},{"$f":"'Personální údaje'!A5","v":0},null,null,null,null,null,null,null,null,null,null,null,null,null,null,null,null,null,null,null,null,null,null,null,null,null,null,null,null,null,{"$f":"SUM(C15:AE15)","v":0},{"$f":"AD15+AC15+V15","v":0},{"$f":"E15+F15+M15+N15+U15+V15+AC15+AD15","v":0},0,0]
{"$rows_left_out":93}
{"sheet":"Tabulky mzdy","index":2,"n_rows":97,"n_cols":17,"rows_kept":97,"cut":false,"hidden":false,"merged":[]}
[]
[]
[null,"Leden"]
[null,"Osobní číslo zaměstnance","Jméno","Středisko","Odpracováno hod.","Tarifní mzda","Prům. hod. výdělek","so+ne (hod)","Příplatek SO+ NE","Noční (hod)","Noční příplatek","Odměna","Řádná dovolená","Náhrada za svátek","Stravné","Sleva-poplatník","počet dětí"]
[null,{"$f":"'Personální údaje'!F3","v":1},{"$f":"'Evidence docházky'!B4","v":0},{"$f":"'Personální údaje'!B3","v":0},{"$f":"'Evidence docházky'!AH4","v":0},null,null,{"$f":"'Evidence docházky'!AI4","v":0},{"$f":"G5/100*25","v":0},{"$f":"'Evidence docházky'!AJ4","v":0},{"$f":"G5/100*20","v":0},{"$f":"'Evidence docházky'!AM4","v":0},null,{"$f":"'Evidence docházky'!AL4","v":0},{"$f":"'Evidence docházky'!AN4","v":0},{"$f":"'Personální údaje'!N3","v":0},{"$f":"'Personální údaje'!L3","v":0}]
[null,{"$f":"'Personální údaje'!F4","v":2},{"$f":"'Evidence docházky'!B5","v":0},{"$f":"'Personální údaje'!B4","v":0},{"$f":"'Evidence docházky'!AH5","v":0},null,null,{"$f":"'Evidence docházky'!AI5","v":0},{"$f":"G6/100*25","v":0},0,{"$f":"G6/100*20","v":0},{"$f":"'Evidence docházky'!AM5","v":0},null,{"$f":"'Evidence docházky'!AL5","v":0},{"$f":"'Evidence docházky'!AN5","v":0},{"$f":"'Personální údaje'!N4","v":0},{"$f":"'Personální údaje'!L4","v":0}]
[null,{"$f":"'Personální údaje'!F5","v":3},{"$f":"'Evidence docházky'!B6","v":0},{"$f":"'Personální údaje'!B6","v":0},{"$f":"'Evidence docházky'!AH6","v":0},null,null,{"$f":"'Evidence docházky'!AI6","v":0},0,{"$f":"'Evidence docházky'!AJ6","v":0},0,{"$f":"'Evidence docházky'!AM6","v":0},null,{"$f":"'Evidence docházky'!AL6","v":0},{"$f":"'Evidence docházky'!AN6","v":0},{"$f":"'Personální údaje'!N5","v":0},{"$f":"'Personální údaje'!L5","v":0}]
[null,{"$f":"'Personální údaje'!F6","v":4},{"$f":"'Evidence docházky'!B7","v":0},{"$f":"'Personální údaje'!B6","v":0},{"$f":"'Evidence docházky'!AH7","v":0},null,null,{"$f":"'Evidence docházky'!AI7","v":0},0,0,0,{"$f":"'Evidence docházky'!AM7","v":0},null,{"$f":"'Evidence docházky'!AL7","v":0},{"$f":"'Evidence docházky'!AN7","v":0},{"$f":"'Personální údaje'!N7","v":0},{"$f":"'Personální údaje'!L6","v":0}]
[null,{"$f":"'Personální údaje'!F7","v":5},{"$f":"'Evidence docházky'!B8","v":0},{"$f":"'Personální údaje'!B7","v":0},{"$f":"'Evidence docházky'!AH8","v":0},null,null,{"$f":"'Evidence docházky'!AI8","v":0},{"$f":"G9/100*25","v":0},0,0,{"$f":"'Evidence docházky'!AM8","v":0},null,{"$f":"'Evidence docházky'!AL8","v":0},{"$f":"'Evidence docházky'!AN8","v":0},{"$f":"'Personální údaje'!N8","v":0},{"$f":"'Personální údaje'!L7","v":0}]
[]
[null,"Únor"]
[null,"Osobní číslo zaměstnance","Jméno","Středisko","Odpracováno hod.","Tarifní mzda","Prům. hod. výdělek","so+ne(hod)","Příplatek SO+ NE","Noční (hod)","Noční příplatek","Odměna","Řádná dovolená","Náhrada za svátek","Stravné","Sleva-poplatník","počet dětí"]
[null,{"$f":"'Personální údaje'!F3","v":1},{"$f":"'Evidence docházky'!B22","v":0},{"$f":"'Personální údaje'!B3","v":0},{"$f":"'Evidence docházky'!AF13","v":0},null,null,{"$f":"'Evidence docházky'!AG13","v":0},{"$f":"G13/100*25","v":0},{"$f":"'Evidence docházky'!AH13","v":0},{"$f":"G13/100*20","v":0},{"$f":"'Evidence docházky'!AK13","v":0},null,{"$f":"'Evidence docházky'!AJ13","v":0},{"$f":"'Evidence docházky'!AL13","v":0},{"$f":"'Personální údaje'!N3","v":0},{"$f":"'Personální údaje'!L3","v":0}]
[null,{"$f":"'Personální údaje'!F4","v":2},{"$f":"'Evidence docházky'!B23","v":0},{"$f":"'Personální údaje'!B4","v":0},{"$f":"'Evidence docházky'!AF14","v":0},null,null,{"$f":"'Evidence docházky'!AG14","v":0},{"$f":"G14/100*25","v":0},0,{"$f":"G14/100*20","v":0},{"$f":"'Evidence docházky'!AK14","v":0},null,{"$f":"'Evidence docházky'!AJ14","v":0},{"$f":"'Evidence docházky'!AL14","v":0},{"$f":"'Personální údaje'!N4","v":0},{"$f":"'Personální údaje'!L4","v":0}]
[null,{"$f":"'Personální údaje'!F5","v":3},{"$f":"'Evidence docházky'!B24","v":0},{"$f":"'Personální údaje'!B5","v":0},{"$f":"'Evidence docházky'!AF15","v":0},null,null,{"$f":"'Evidence docházky'!AG15","v":0},0,{"$f":"'Evidence docházky'!AH15","v":0},0,{"$f":"'Evidence docházky'!AK15","v":0},null,{"$f":"'Evidence docházky'!AJ15","v":0},{"$f":"'Evidence docházky'!AL15","v":0},{"$f":"'Personální údaje'!N5","v":0},{"$f":"'Personální údaje'!L5","v":0}]
{"$rows_left_out":83}
{"sheet":"Leden","index":3,"n_rows":29,"n_cols":12,"rows_kept":29,"cut":false,"hidden":false,"merged":[]}
[]
[]
[null,"Leden"]
[]
[null,"Osobní číslo",1]
[]
[null,"Jméno",{"$f":"INDEX('Tabulky mzdy'!C5:C9,MATCH(C5,'Tabulky mzdy'!B5:B9,0),1)","v":0}]
[]
[null,"Středisko",{"$f":"INDEX('Tabulky mzdy'!D5:D9,MATCH(C5,'Tabulky mzdy'!B5:B9,0),1)","v":0}]
[]
[]
[]
[]
[null,"Prac.doba","odpracováno (hod.)","odpracováno so+ne (hod)","odpracováno noční (hod)",null,null,"Tarifní mzda",{"$f":"INDEX('Tabulky mzdy'!F5:F9,MATCH(C5,'Tabulky mzdy'!B5:B9,0),1)","v":0}]
[null,null,{"$f":"INDEX('Tabulky mzdy'!E5:E9,MATCH(C5,'Tabulky mzdy'!B5:B9,0),1)","v":0},{"$f":"INDEX('Tabulky mzdy'!H5:H9,MATCH(C5,'Tabulky mzdy'!B5:B9,0),1)","v":0},{"$f":"INDEX('Tabulky mzdy'!J5:J9,MATCH(C5,'Tabulky mzdy'!B5:B9,0),1)","v":0}]
{"$rows_left_out":15}
{"sheet":"Únor","index":4,"n_rows":29,"n_cols":12,"rows_kept":29,"cut":false,"hidden":false,"merged":[]}
[]
[]
[null,"Únor"]
[]
[null,"Osobní číslo",1]
[]
[null,"Jméno",{"$f":"INDEX('Tabulky mzdy'!C13:C17,MATCH(C5,'Tabulky mzdy'!B13:B17,0),1)","v":0}]
[]
[null,"Středisko",{"$f":"INDEX('Tabulky mzdy'!D13:D17,MATCH(C5,'Tabulky mzdy'!B13:B17,0),1)","v":0}]
[]
[]
[]
[]
[null,"Prac.doba","odpracováno (hod.)","odpracováno so+ne (hod)","odpracováno noční (hod)",null,null,"Tarifní mzda",{"$f":"INDEX('Tabulky mzdy'!F13:F17,MATCH(C5,'Tabulky mzdy'!B13:B17,0),1)","v":0}]
[null,null,{"$f":"INDEX('Tabulky mzdy'!E13:E17,MATCH(C5,'Tabulky mzdy'!B13:B17,0),1)","v":0},{"$f":"INDEX('Tabulky mzdy'!H13:H17,MATCH(C5,'Tabulky mzdy'!B13:B17,0),1)","v":0},{"$f":"INDEX('Tabulky mzdy'!J13:J17,MATCH(C5,'Tabulky mzdy'!B13:B17,0),1)","v":0}]
{"$rows_left_out":15}
{"sheet":"Březen","index":5,"n_rows":29,"n_cols":12,"rows_kept":29,"cut":false,"hidden":false,"merged":[]}
[]
[]
[null,"Březen"]
[]
[null,"Osobní číslo",1]
[]
[null,"Jméno",{"$f":"INDEX('Tabulky mzdy'!C21:C25,MATCH(C5,'Tabulky mzdy'!B21:B25,0),1)","v":0}]
[]
[null,"Středisko",{"$f":"INDEX('Tabulky mzdy'!D21:D25,MATCH(C5,'Tabulky mzdy'!B21:B25,0),1)","v":0}]
[]
[]
[]
[]
[null,"Prac.doba","odpracováno (hod.)","odpracováno so+ne (hod)","odpracováno noční (hod)",null,null,"Tarifní mzda",{"$f":"INDEX('Tabulky mzdy'!F21:F25,MATCH(C5,'Tabulky mzdy'!B21:B25,0),1)","v":0}]
[null,null,{"$f":"INDEX('Tabulky mzdy'!E21:E25,MATCH(C5,'Tabulky mzdy'!B21:B25,0),1)","v":0},{"$f":"INDEX('Tabulky mzdy'!H21:H25,MATCH(C5,'Tabulky mzdy'!B21:B25,0),1)","v":0},{"$f":"INDEX('Tabulky mzdy'!J21:J25,MATCH(C5,'Tabulky mzdy'!B21:B25,0),1)","v":0}]
{"$rows_left_out":15}
{"sheet":"Duben","index":6,"n_rows":29,"n_cols":12,"rows_kept":29,"cut":false,"hidden":false,"merged":[]}
[]
[]
[null,"Duben"]
[]
[null,"Osobní číslo",1]
[]
[null,"Jméno",{"$f":"INDEX('Tabulky mzdy'!C29:C33,MATCH(C5,'Tabulky mzdy'!B29:B33,0),1)","v":0}]
[]
[null,"Středisko",{"$f":"INDEX('Tabulky mzdy'!D29:D33,MATCH(C5,'Tabulky mzdy'!B29:B33,0),1)","v":0}]
[]
[]
[]
[]
[null,"Prac.doba","odpracováno (hod.)","odpracováno so+ne (hod)","odpracováno noční (hod)",null,null,"Tarifní mzda",{"$f":"INDEX('Tabulky mzdy'!F29:F33,MATCH(C5,'Tabulky mzdy'!B29:B33,0),1)","v":0}]
[null,null,{"$f":"INDEX('Tabulky mzdy'!E29:E33,MATCH(C5,'Tabulky mzdy'!B29:B33,0),1)","v":0},{"$f":"INDEX('Tabulky mzdy'!H29:H33,MATCH(C5,'Tabulky mzdy'!B29:B33,0),1)","v":0},{"$f":"INDEX('Tabulky mzdy'!J29:J33,MATCH(C5,'Tabulky mzdy'!B29:B33,0),1)","v":0}]
{"$rows_left_out":15}
{"sheet":"Květen","index":7,"n_rows":29,"n_cols":12,"rows_kept":29,"cut":false,"hidden":false,"merged":[]}
[]
[]
[null,"Květen"]
[]
[null,"Osobní číslo",1]
[]
[null,"Jméno",{"$f":"INDEX('Tabulky mzdy'!C37:C41,MATCH(C5,'Tabulky mzdy'!B37:B41,0),1)","v":0}]
[]
[null,"Středisko",{"$f":"INDEX('Tabulky mzdy'!D37:D41,MATCH(C5,'Tabulky mzdy'!B37:B41,0),1)","v":0}]
[]
[]
[]
[]
[null,"Prac.doba","odpracováno (hod.)","odpracováno so+ne (hod)","odpracováno noční (hod)",null,null,"Tarifní mzda",{"$f":"INDEX('Tabulky mzdy'!F37:F41,MATCH(C5,'Tabulky mzdy'!B37:B41,0),1)","v":0}]
[null,null,{"$f":"INDEX('Tabulky mzdy'!E37:E41,MATCH(C5,'Tabulky mzdy'!B37:B41,0),1)","v":0},{"$f":"INDEX('Tabulky mzdy'!H37:H41,MATCH(C5,'Tabulky mzdy'!B37:B41,0),1)","v":0},{"$f":"INDEX('Tabulky mzdy'!J37:J41,MATCH(C5,'Tabulky mzdy'!B37:B41,0),1)","v":0}]
{"$rows_left_out":15}
{"sheet":"Červen","index":8,"n_rows":29,"n_cols":12,"rows_kept":29,"cut":false,"hidden":false,"merged":[]}
[]
[]
[null,"Červen"]
[]
[null,"Osobní číslo",1]
[]
[null,"Jméno",{"$f":"INDEX('Tabulky mzdy'!C45:C49,MATCH(C5,'Tabulky mzdy'!B45:B49,0),1)","v":0}]
[]
[null,"Středisko",{"$f":"INDEX('Tabulky mzdy'!D45:D49,MATCH(C5,'Tabulky mzdy'!B45:B49,0),1)","v":0}]
[]
[]
[]
[]
[null,"Prac.doba","odpracováno (hod.)","odpracováno so+ne (hod)","odpracováno noční (hod)",null,null,"Tarifní mzda",{"$f":"INDEX('Tabulky mzdy'!F45:F49,MATCH(C5,'Tabulky mzdy'!B45:B49,0),1)","v":0}]
[null,null,{"$f":"INDEX('Tabulky mzdy'!E45:E49,MATCH(C5,'Tabulky mzdy'!B45:B49,0),1)","v":0},{"$f":"INDEX('Tabulky mzdy'!H45:H49,MATCH(C5,'Tabulky mzdy'!B45:B49,0),1)","v":0},{"$f":"INDEX('Tabulky mzdy'!J45:J49,MATCH(C5,'Tabulky mzdy'!B45:B49,0),1)","v":0}]
{"$rows_left_out":15}
{"sheet":"Červenec","index":9,"n_rows":29,"n_cols":12,"rows_kept":29,"cut":false,"hidden":false,"merged":[]}
[]
[]
[null,"Červenec"]
[]
[null,"Osobní číslo",1]
[]
[null,"Jméno",{"$f":"INDEX('Tabulky mzdy'!C53:C57,MATCH(C5,'Tabulky mzdy'!B53:B57,0),1)","v":0}]
[]
[null,"Středisko",{"$f":"INDEX('Tabulky mzdy'!D53:D57,MATCH(C5,'Tabulky mzdy'!B53:B57,0),1)","v":0}]
[]
[]
[]
[]
[null,"Prac.doba","odpracováno (hod.)","odpracováno so+ne (hod)","odpracováno noční (hod)",null,null,"Tarifní mzda",{"$f":"INDEX('Tabulky mzdy'!F53:F57,MATCH(C5,'Tabulky mzdy'!B53:B57,0),1)","v":0}]
[null,null,{"$f":"INDEX('Tabulky mzdy'!E53:E57,MATCH(C5,'Tabulky mzdy'!B53:B57,0),1)","v":0},{"$f":"INDEX('Tabulky mzdy'!H53:H57,MATCH(C5,'Tabulky mzdy'!B53:B57,0),1)","v":0},{"$f":"INDEX('Tabulky mzdy'!J53:J57,MATCH(C5,'Tabulky mzdy'!B53:B57,0),1)","v":0}]
{"$rows_left_out":15}
{"sheet":"Srpen","index":10,"n_rows":29,"n_cols":12,"rows_kept":29,"cut":false,"hidden":false,"merged":[]}
[]
[]
[null,"Srpen"]
[]
[null,"Osobní číslo",1]
[]
[null,"Jméno",{"$f":"INDEX('Tabulky mzdy'!C61:C65,MATCH(C5,'Tabulky mzdy'!B61:B65,0),1)","v":0}]
[]
[null,"Středisko",{"$f":"INDEX('Tabulky mzdy'!D61:D65,MATCH(C5,'Tabulky mzdy'!B61:B65,0),1)","v":0}]
[]
[]
[]
[]
[null,"Prac.doba","odpracováno (hod.)","odpracováno so+ne (hod)","odpracováno noční (hod)",null,null,"Tarifní mzda",{"$f":"INDEX('Tabulky mzdy'!F61:F65,MATCH(C5,'Tabulky mzdy'!B61:B65,0),1)","v":0}]
[null,null,{"$f":"INDEX('Tabulky mzdy'!E61:E65,MATCH(C5,'Tabulky mzdy'!B61:B65,0),1)","v":0},{"$f":"INDEX('Tabulky mzdy'!H61:H65,MATCH(C5,'Tabulky mzdy'!B61:B65,0),1)","v":0},{"$f":"INDEX('Tabulky mzdy'!J61:J65,MATCH(C5,'Tabulky mzdy'!B61:B65,0),1)","v":0}]
{"$rows_left_out":15}
{"sheet":"Září","index":11,"n_rows":29,"n_cols":12,"rows_kept":29,"cut":false,"hidden":false,"merged":[]}
[]
[]
[null,"Září"]
[]
[null,"Osobní číslo",1]
[]
[null,"Jméno",{"$f":"INDEX('Tabulky mzdy'!C69:C73,MATCH(C5,'Tabulky mzdy'!B69:B73,0),1)","v":0}]
[]
[null,"Středisko",{"$f":"INDEX('Tabulky mzdy'!D69:D73,MATCH(C5,'Tabulky mzdy'!B69:B73,0),1)","v":0}]
[]
[]
[]
[]
[null,"Prac.doba","odpracováno (hod.)","odpracováno so+ne (hod)","odpracováno noční (hod)",null,null,"Tarifní mzda",{"$f":"INDEX('Tabulky mzdy'!F69:F73,MATCH(C5,'Tabulky mzdy'!B69:B73,0),1)","v":0}]
[null,null,{"$f":"INDEX('Tabulky mzdy'!E69:E73,MATCH(C5,'Tabulky mzdy'!B69:B73,0),1)","v":0},{"$f":"INDEX('Tabulky mzdy'!H69:H73,MATCH(C5,'Tabulky mzdy'!B69:B73,0),1)","v":0},{"$f":"INDEX('Tabulky mzdy'!J69:J73,MATCH(C5,'Tabulky mzdy'!B69:B73,0),1)","v":0}]
{"$rows_left_out":15}
{"sheet":"Říjen","index":12,"n_rows":29,"n_cols":12,"rows_kept":29,"cut":false,"hidden":false,"merged":[]}
[]
[]
[null,"Říjen"]
[]
[null,"Osobní číslo",1]
[]
[null,"Jméno",{"$f":"INDEX('Tabulky mzdy'!C77:C81,MATCH(C5,'Tabulky mzdy'!B77:B81,0),1)","v":0}]
[]
[null,"Středisko",{"$f":"INDEX('Tabulky mzdy'!D77:D81,MATCH(C5,'Tabulky mzdy'!B77:B81,0),1)","v":0}]
[]
[]
[]
[]
[null,"Prac.doba","odpracováno (hod.)","odpracováno so+ne (hod)","odpracováno noční (hod)",null,null,"Tarifní mzda",{"$f":"INDEX('Tabulky mzdy'!F77:F81,MATCH(C5,'Tabulky mzdy'!B77:B81,0),1)","v":0}]
[null,null,{"$f":"INDEX('Tabulky mzdy'!E77:E81,MATCH(C5,'Tabulky mzdy'!B77:B81,0),1)","v":0},{"$f":"INDEX('Tabulky mzdy'!H77:H81,MATCH(C5,'Tabulky mzdy'!B77:B81,0),1)","v":0},{"$f":"INDEX('Tabulky mzdy'!J77:J81,MATCH(C5,'Tabulky mzdy'!B77:B81,0),1)","v":0}]
{"$rows_left_out":15}
{"sheet":"Listopad","index":13,"n_rows":29,"n_cols":12,"rows_kept":29,"cut":false,"hidden":false,"merged":[]}
[]
[]
[null,"Listopad"]
[]
[null,"Osobní číslo",1]
[]
[null,"Jméno",{"$f":"INDEX('Tabulky mzdy'!C85:C89,MATCH(C5,'Tabulky mzdy'!B85:B89,0),1)","v":0}]
[]
[null,"Středisko",{"$f":"INDEX('Tabulky mzdy'!D85:D89,MATCH(C5,'Tabulky mzdy'!B85:B89,0),1)","v":0}]
[]
[]
[]
[]
[null,"Prac.doba","odpracováno (hod.)","odpracováno so+ne (hod)","odpracováno noční (hod)",null,null,"Tarifní mzda",{"$f":"INDEX('Tabulky mzdy'!F85:F89,MATCH(C5,'Tabulky mzdy'!B85:B89,0),1)","v":0}]
[null,null,{"$f":"INDEX('Tabulky mzdy'!E85:E89,MATCH(C5,'Tabulky mzdy'!B85:B89,0),1)","v":0},{"$f":"INDEX('Tabulky mzdy'!H85:H89,MATCH(C5,'Tabulky mzdy'!B85:B89,0),1)","v":0},{"$f":"INDEX('Tabulky mzdy'!J85:J89,MATCH(C5,'Tabulky mzdy'!B85:B89,0),1)","v":0}]
{"$rows_left_out":15}
{"sheet":"Prosinec","index":14,"n_rows":29,"n_cols":12,"rows_kept":29,"cut":false,"hidden":false,"merged":[]}
[]
[]
[null,"Prosinec"]
[]
[null,"Osobní číslo",1]
[]
[null,"Jméno",{"$f":"INDEX('Tabulky mzdy'!C93:C97,MATCH(C5,'Tabulky mzdy'!B93:B97,0),1)","v":0}]
[]
[null,"Středisko",{"$f":"INDEX('Tabulky mzdy'!D93:D97,MATCH(C5,'Tabulky mzdy'!B93:B97,0),1)","v":0}]
[]
[]
[]
[]
[null,"Prac.doba","odpracováno (hod.)","odpracováno so+ne (hod)","odpracováno noční (hod)",null,null,"Tarifní mzda",{"$f":"INDEX('Tabulky mzdy'!F93:F97,MATCH(C5,'Tabulky mzdy'!B93:B97,0),1)","v":0}]
[null,null,{"$f":"INDEX('Tabulky mzdy'!E93:E97,MATCH(C5,'Tabulky mzdy'!B93:B97,0),1)","v":0},{"$f":"INDEX('Tabulky mzdy'!H93:H97,MATCH(C5,'Tabulky mzdy'!B93:B97,0),1)","v":0},{"$f":"INDEX('Tabulky mzdy'!J93:J97,MATCH(C5,'Tabulky mzdy'!B93:B97,0),1)","v":0}]
{"$rows_left_out":15}
{"sheet":"Tabulky daně","index":15,"n_rows":7,"n_cols":16,"rows_kept":7,"cut":false,"hidden":false,"merged":[]}
[]
[null,"Osobní číslo zaměstnance","Jméno","Středisko","Úhrn příjmů","Úhrn pojistného","Úhrn sražených záloh","Vyplacené daňové bonusy","hodnota darů","úroky z úvěrů","penzijní připojištění","životní pojištění","odborové příspěvky","Sleva na poplatníka","Sleva na manželku","Počet dětí"]
[null,9001,null,null,0,0,0,0]
[null,9002,null,null,0,0,0,0]
[null,9003,null,null,0,0,0,0]
[null,9004,null,null,0,0,0,0]
[null,9005,null,null,0,0,0,0]

{"sheet":"Roční zúčtování daně ","index":16,"n_rows":34,"n_cols":3,"rows_kept":34,"cut":false,"hidden":false,"merged":[]}
[]
["Osobní číslo",9001]
[]
["Jméno",{"$f":"INDEX('Tabulky daně'!C3:C7,MATCH('Roční zúčtování daně '!B2,'Tabulky daně'!B3:B7,0))","v":0}]
[]
["Středisko",{"$f":"INDEX('Tabulky daně'!D3:D7,MATCH('Roční zúčtování daně '!B2,'Tabulky daně'!B3:B7,0))","v":0}]
[]
[]
[null,"Výpočet roční daňové povinnosti"]
[null,"Úhrn příjmů",{"$f":"INDEX('Tabulky daně'!E3:E7,MATCH('Roční zúčtování daně '!B2,'Tabulky daně'!B3:B7,0))","v":0}]
[null,"Úhrn pojistného",{"$f":"INDEX('Tabulky daně'!F3:F7,MATCH('Roční zúčtování daně '!B2,'Tabulky daně'!B3:B7,0))","v":0}]
[null,"Dílčí základ daně",{"$f":"C10+C11","v":0}]
[null,"Nezdanitelné částky"]
[null,"hodnota darů",{"$f":"INDEX('Tabulky daně'!I3:I7,MATCH('Roční zúčtování daně '!B2,'Tabulky daně'!B3:B7,0))","v":0}]
[null,"úroky z úvěrů",{"$f":"INDEX('Tabulky daně'!J3:J7,MATCH('Roční zúčtování daně '!B2,'Tabulky daně'!B3:B7,0))","v":0}]
{"$rows_left_out":19}